This forum uses cookies
This forum makes use of cookies to store your login information if you are registered, and your last visit if you are not. Cookies are small text documents stored on your computer; the cookies set by this forum can only be used on this website and pose no security risk. Cookies on this forum also track the specific topics you have read and when you last read them. Please confirm whether you accept or reject these cookies being set.

A cookie will be stored in your browser regardless of choice to prevent you being asked this question again. You will be able to change your cookie settings at any time using the link in the footer.

Post Reply 
 
Thread Rating:
  • 1 Votes - 5 Average
  • 1
  • 2
  • 3
  • 4
  • 5
A-men 2 [NPEB01210]
12-18-2015, 01:21 PM (This post was last modified: 01-06-2016 08:20 PM by tambre.)
Post: #1
A-men 2 [NPEB01210]
RPCS3 V0.0.0.6-3945-5672ba8-LLE
This game show intro, show menu and missing graphic(player )Cool

LLE:
cellFiber_Library
cellSail_Library
cellSpursJq_Library
cellSre_Library





Attached File(s)
.rar  Log & LLE Set A-man 2 [NPEB01210].rar (Size: 86.23 KB / Downloads: 34)
Find all posts by this user
Quote this message in a reply
02-09-2016, 09:01 PM
Post: #2
RE: A-men 2 [NPEB01210]
rpcs3-v0.0.0.6-460-g303a109-win_x64

DirectX 12
Gets ingame perfectly with PPU Interpreter 2 and SPU Interpreter 2 but crashes due to.
LLE'd libs indicated in the post above.

   

Code:
{rsx::thread} RSX: FS build failed:C:\Users\Annie\Desktop\rpcs3_460\FragmentProgram.hlsl(82,18-22): error X3000: syntax error: unexpected token 'break'
C:\Users\Annie\Desktop\rpcs3_460\FragmentProgram.hlsl(82,8-30): error X3013: 'saturate': no matching 1 parameter intrinsic function
C:\Users\Annie\Desktop\rpcs3_460\FragmentProgram.hlsl(82,8-30): error X3013: Possible intrinsic functions are:
C:\Users\Annie\Desktop\rpcs3_460\FragmentProgram.hlsl(82,8-30): error X3013:     saturate(float|half|double|min10float|min16float)

Should an issue be opened?


Attached File(s)
.zip  rpcs3_460.zip (Size: 137.71 KB / Downloads: 6)

Desktop: AMD FX-8350 | AMD R9 280X 3G
Laptop: Intel i7-6700HQ | NVIDIA GTX 960M 2G
Find all posts by this user
Quote this message in a reply
02-10-2016, 05:45 AM
Post: #3
RE: A-men 2 [NPEB01210]
(02-09-2016 09:01 PM)Annie Wrote:  rpcs3-v0.0.0.6-460-g303a109-win_x64

DirectX 12
Gets ingame perfectly with PPU Interpreter 2 and SPU Interpreter 2 but crashes due to.
LLE'd libs indicated in the post above.



Code:
{rsx::thread} RSX: FS build failed:C:\Users\Annie\Desktop\rpcs3_460\FragmentProgram.hlsl(82,18-22): error X3000: syntax error: unexpected token 'break'
C:\Users\Annie\Desktop\rpcs3_460\FragmentProgram.hlsl(82,8-30): error X3013: 'saturate': no matching 1 parameter intrinsic function
C:\Users\Annie\Desktop\rpcs3_460\FragmentProgram.hlsl(82,8-30): error X3013: Possible intrinsic functions are:
C:\Users\Annie\Desktop\rpcs3_460\FragmentProgram.hlsl(82,8-30): error X3013:     saturate(float|half|double|min10float|min16float)

Should an issue be opened?

Code:
Unimplemented TEX_SRB instruction: UPB

Not sure, if there already was an issue for that. If not, feel free to open one.
Find all posts by this user
Quote this message in a reply
02-20-2017, 02:34 PM (This post was last modified: 02-20-2017 02:34 PM by digitaldude.)
Post: #4
RE: A-men 2 [NPEB01210]
rpcs3-v0.0.1-2017-02-19-47fdaf69_win64

You can see the characters now, would be playable if not for the broken saves.


Attached File(s) Thumbnail(s)
   

.rar  RPCS3amen2.rar (Size: 195.03 KB / Downloads: 1)
Find all posts by this user
Quote this message in a reply
04-13-2017, 05:06 PM
Post: #5
RE: A-men 2 [NPEB01210]
rpcs3-v0.0.2-2017-04-11-18ccd9e4_win64

Saves work now.

Image


Attached File(s)
.rar  RPCS3amen2.rar (Size: 189.19 KB / Downloads: 3)
Find all posts by this user
Quote this message in a reply
Post Reply 


Forum Jump:


User(s) browsing this thread: 1 Guest(s)